Target
Potassium voltage-gated channel subfamily A member 3
Ligand
BDBM50030516
Substrate
Meas. Tech.
ChEMBL_141443 (CHEMBL750216)
IC50
259±n/a nM
Citation
 Michne, WFGuiles, JWTreasurywala, AMCastonguay, LAWeigelt, CAOconnor, BVolberg, WAGrant, AMChadwick, CCKrafte, DS Novel inhibitors of potassium ion channels on human T lymphocytes. J Med Chem 38:1877-83 (1995)  
Target
Name:
Potassium voltage-gated channel subfamily A member 3
Synonyms:
HGK5 HPCN3 KCNA3 Potassium voltage-gated channel subfamily A member 3 Voltage-gated potassium channel subunit Kv1.3
Type:
PROTEIN
Mol. Mass.:
63835.47
Organism:
Homo sapiens (Human)
Description:
ChEMBL_1513935
Residue:
575
  
Inhibitor
Name:
BDBM50030516
Synonyms:
CHEMBL54846 | [7-Chloro-1-(2-chloro-benzyl)-1H-quinolin-(4E)-ylidene]-(2,4-dichloro-benzyl)-amine
Type:
Small organic molecule
Emp. Form.:
C23H16Cl4N2
Mol. Mass.:
462.199
SMILES:
Clc1ccc(C\N=c2/ccn(Cc3ccccc3Cl)c3cc(Cl)ccc23)c(Cl)c1
: