Target
Type-2 angiotensin II receptor
Ligand
BDBM50030700
Substrate
Meas. Tech.
ChEMBL_35413 (CHEMBL643587)
IC50
0.140000±n/a nM
Citation
 Chang, LLAshton, WTFlanagan, KLChen, TBO'Malley, SSZingaro, GJKivlighn, SDSiegl, PKLotti, VJChang, RS Potent and orally active angiotensin II receptor antagonists with equal affinity for human AT1 and AT2 subtypes. J Med Chem 38:3741-58 (1995)  
Target
Name:
Type-2 angiotensin II receptor
Synonyms:
AGTR2_RAT Agtr2 Angiotensin II receptor Type-2 angiotensin II receptor
Type:
Enzyme Catalytic Domain
Mol. Mass.:
41346.62
Organism:
RAT
Description:
Angiotensin II AT2 0 0::P35351
Residue:
363
  
Inhibitor
Name:
BDBM50030700
Synonyms:
CHEMBL436396 | N-{4-Bromo-3-[4-(3-fluoro-2'-(N-t-butyloxycarbonyl)-Sulfanamido-biphenyl-4-ylmethyl)-5-oxo-3-propyl-4,5-dihydro-[1,2,4]triazol-1-yl]-phenyl}-propionamide
Type:
Small organic molecule
Emp. Form.:
C32H35BrFN5O6S
Mol. Mass.:
716.618
SMILES:
CCCc1nn(-c2cc(NC(=O)CC)ccc2Br)c(=O)n1Cc1ccc(cc1F)-c1ccccc1S(=O)(=O)NC(=O)OC(C)(C)C
: