Target
Type-2 angiotensin II receptor
Ligand
BDBM50030715
Substrate
Meas. Tech.
ChEMBL_35412 (CHEMBL643586)
IC50
0.210000±n/a nM
Citation
 Chang, LLAshton, WTFlanagan, KLChen, TBO'Malley, SSZingaro, GJKivlighn, SDSiegl, PKLotti, VJChang, RS Potent and orally active angiotensin II receptor antagonists with equal affinity for human AT1 and AT2 subtypes. J Med Chem 38:3741-58 (1995)  
Target
Name:
Type-2 angiotensin II receptor
Synonyms:
AGTR2_RAT Agtr2 Angiotensin II receptor Type-2 angiotensin II receptor
Type:
Enzyme Catalytic Domain
Mol. Mass.:
41346.62
Organism:
RAT
Description:
Angiotensin II AT2 0 0::P35351
Residue:
363
  
Inhibitor
Name:
BDBM50030715
Synonyms:
CHEMBL338137 | N-{3-[3-Butyl-4-(3-fluoro-2-(N-t-butyloxycarbonyl)-Sulfanamido-biphenyl-4-ylmethyl)-5-oxo-4,5-dihydro-[1,2,4]triazol-1-yl]-4-trifluoromethyl-phenyl}-benzamide
Type:
Small organic molecule
Emp. Form.:
C38H37F4N5O6S
Mol. Mass.:
767.789
SMILES:
CCCCc1nn(-c2cc(NC(=O)c3ccccc3)ccc2C(F)(F)F)c(=O)n1Cc1ccc(cc1F)-c1ccccc1S(=O)(=O)NC(=O)OC(C)(C)C
: