Target
Type-1 angiotensin II receptor
Ligand
BDBM50030687
Substrate
Meas. Tech.
ChEMBL_36952 (CHEMBL648855)
IC50
0.130000±n/a nM
Citation
 Chang, LLAshton, WTFlanagan, KLChen, TBO'Malley, SSZingaro, GJKivlighn, SDSiegl, PKLotti, VJChang, RS Potent and orally active angiotensin II receptor antagonists with equal affinity for human AT1 and AT2 subtypes. J Med Chem 38:3741-58 (1995)  
Target
Name:
Type-1 angiotensin II receptor
Synonyms:
AGTR1 ANGIOTENSIN AT1 Angiotensin II type 1a (AT-1a) receptor
Type:
Enzyme Catalytic Domain
Mol. Mass.:
41009.15
Organism:
RABBIT
Description:
ANGIOTENSIN AT1 AGTR1 RABBIT::P34976
Residue:
359
  
Inhibitor
Name:
BDBM50030687
Synonyms:
CHEMBL339256 | N-(3-{3-Butyl-4-[2'-(2-chloro-benzoylsulfamoyl)-3-fluoro-biphenyl-4-ylmethyl]-5-oxo-4,5-dihydro-[1,2,4]triazol-1-yl}-4-trifluoromethyl-phenyl)-propionamide
Type:
Small organic molecule
Emp. Form.:
C36H32ClF4N5O5S
Mol. Mass.:
758.181
SMILES:
CCCCc1nn(-c2cc(NC(=O)CC)ccc2C(F)(F)F)c(=O)n1Cc1ccc(cc1F)-c1ccccc1S(=O)(=O)NC(=O)c1ccccc1Cl
: