Target
Type-1 angiotensin II receptor
Ligand
BDBM50030688
Substrate
Meas. Tech.
ChEMBL_36952 (CHEMBL648855)
IC50
0.2±n/a nM
Citation
 Chang, LLAshton, WTFlanagan, KLChen, TBO'Malley, SSZingaro, GJKivlighn, SDSiegl, PKLotti, VJChang, RS Potent and orally active angiotensin II receptor antagonists with equal affinity for human AT1 and AT2 subtypes. J Med Chem 38:3741-58 (1995)  
Target
Name:
Type-1 angiotensin II receptor
Synonyms:
AGTR1 AGTR1B AT1 AT1BR AT2R1B Angiotensin II receptor Type-1 angiotensin II receptor (AT1)
Type:
Protein
Mol. Mass.:
41080.75
Organism:
Homo sapiens (Human)
Description:
P30556
Residue:
359
  
Inhibitor
Name:
BDBM50030688
Synonyms:
CHEMBL122917 | N-(3-{3-Butyl-4-[2'-(3,3-dimethyl-butyrylsulfamoyl)-3-fluoro-biphenyl-4-ylmethyl]-5-oxo-4,5-dihydro-[1,2,4]triazol-1-yl}-4-trifluoromethyl-phenyl)-propionamide
Type:
Small organic molecule
Emp. Form.:
C35H39F4N5O5S
Mol. Mass.:
717.773
SMILES:
CCCCc1nn(-c2cc(NC(=O)CC)ccc2C(F)(F)F)c(=O)n1Cc1ccc(cc1F)-c1ccccc1S(=O)(=O)NC(=O)CC(C)(C)C
: