Target
Type-2 angiotensin II receptor
Ligand
BDBM50030691
Substrate
Meas. Tech.
ChEMBL_35273 (CHEMBL648578)
IC50
1.5±n/a nM
Citation
 Chang, LLAshton, WTFlanagan, KLChen, TBO'Malley, SSZingaro, GJKivlighn, SDSiegl, PKLotti, VJChang, RS Potent and orally active angiotensin II receptor antagonists with equal affinity for human AT1 and AT2 subtypes. J Med Chem 38:3741-58 (1995)  
Target
Name:
Type-2 angiotensin II receptor
Synonyms:
AGTR2 AT2 Angiotensin II type 2 (AT-2) receptor Type-2 angiotensin II receptor
Type:
Enzyme Catalytic Domain
Mol. Mass.:
41201.61
Organism:
Homo sapiens (Human)
Description:
Angiotensin II, central 0 0::P50052
Residue:
363
  
Inhibitor
Name:
BDBM50030691
Synonyms:
CHEMBL122380 | Pentanoic acid (4-bromo-3-{4-[2'-(2,5-difluoro-benzoylsulfamoyl)-3-fluoro-biphenyl-4-ylmethyl]-3-ethyl-5-oxo-4,5-dihydro-[1,2,4]triazol-1-yl}-phenyl)-amide
Type:
Small organic molecule
Emp. Form.:
C35H31BrF3N5O5S
Mol. Mass.:
770.615
SMILES:
CCCCC(=O)Nc1ccc(Br)c(c1)-n1nc(CC)n(Cc2ccc(cc2F)-c2ccccc2S(=O)(=O)NC(=O)c2cc(F)ccc2F)c1=O
: