Target
Type-2 angiotensin II receptor
Ligand
BDBM50030683
Substrate
Meas. Tech.
ChEMBL_35412 (CHEMBL643586)
IC50
0.19±n/a nM
Citation
 Chang, LLAshton, WTFlanagan, KLChen, TBO'Malley, SSZingaro, GJKivlighn, SDSiegl, PKLotti, VJChang, RS Potent and orally active angiotensin II receptor antagonists with equal affinity for human AT1 and AT2 subtypes. J Med Chem 38:3741-58 (1995)  
Target
Name:
Type-2 angiotensin II receptor
Synonyms:
AGTR2_RAT Agtr2 Angiotensin II receptor Type-2 angiotensin II receptor
Type:
Enzyme Catalytic Domain
Mol. Mass.:
41346.62
Organism:
RAT
Description:
Angiotensin II AT2 0 0::P35351
Residue:
363
  
Inhibitor
Name:
BDBM50030683
Synonyms:
CHEMBL121907 | N-Butyl-3-[4-(3-fluoro-2'-(N-t-butyloxycarbonyl)-Sulfanamido-4-ylmethyl)-5-oxo-3-propyl-4,5-dihydro-[1,2,4]triazol-1-yl]-4-trifluoromethyl-benzamide
Type:
Small organic molecule
Emp. Form.:
C35H39F4N5O6S
Mol. Mass.:
733.773
SMILES:
CCCCNC(=O)c1ccc(c(c1)-n1nc(CCC)n(Cc2ccc(cc2F)-c2ccccc2S(=O)(=O)NC(=O)OC(C)(C)C)c1=O)C(F)(F)F
: