Target
Dihydrofolate reductase
Ligand
BDBM50030820
Substrate
Meas. Tech.
ChEMBL_54128 (CHEMBL668083)
IC50
450±n/a nM
Citation
 Gangjee, ADevraj, RMcGuire, JJKisliuk, RL Effect of bridge region variation on antifolate and antitumor activity of classical 5-substituted 2,4-diaminofuro[2,3-d]pyrimidines. J Med Chem 38:3798-805 (1995)  
Target
Name:
Dihydrofolate reductase
Synonyms:
DHFR Dihydrofolate reductase (DHFR) | Tetrahydrofolate dehydrogenase
Type:
Enzyme
Mol. Mass.:
21453.99
Organism:
Homo sapiens (Human)
Description:
Recombinant human DHFR.
Residue:
187
  
Inhibitor
Name:
BDBM50030820
Synonyms:
(S)-2-(4-((2,4-diaminofuro[2,3-d]pyrimidin-5-yl)methylamino)benzamido)pentanedioic acid 2-{4-[(2,4-Diamino-furo[2,3-d]pyrimidin-5-ylmethyl)-amino]-benzoylamino}-pentanedioic acid | CHEMBL106628
Type:
Small organic molecule
Emp. Form.:
C19H20N6O6
Mol. Mass.:
428.3987
SMILES:
Nc1nc(N)c2c(CNc3ccc(cc3)C(=O)N[C@@H](CCC(O)=O)C(O)=O)coc2n1
: