Target
Chymotrypsin-like elastase family member 2A
Ligand
BDBM50031187
Substrate
Meas. Tech.
ChEMBL_152314 (CHEMBL756767)
Ki
26±n/a nM
Citation
 Edwards, PDZottola, MADavis, MWilliams, JTuthill, PA Peptidyl alpha-ketoheterocyclic inhibitors of human neutrophil elastase. 3. In vitro and in vivo potency of a series of peptidyl alpha-ketobenzoxazoles. J Med Chem 38:3972-82 (1995)  
Target
Name:
Chymotrypsin-like elastase family member 2A
Synonyms:
CEL2A_PIG ELA2 Elastase 2A Elastase-2A | Pancreatic elastase
Type:
PROTEIN
Mol. Mass.:
28705.23
Organism:
Sus scrofa
Description:
ChEMBL_156951
Residue:
269
  
Inhibitor
Name:
BDBM50031187
Synonyms:
2-{(S)-2-[((S)-1-{(S)-2-[4-(4-Chloro-benzenesulfonylaminocarbonyl)-benzoylamino]-3-methyl-butyryl}-pyrrolidine-2-carbonyl)-amino]-3-methyl-butyryl}-benzooxazole-5-carboxylic acid amide | CHEMBL419985
Type:
Small organic molecule
Emp. Form.:
C37H39ClN6O9S
Mol. Mass.:
779.258
SMILES:
CC(C)[C@H](NC(=O)c1ccc(cc1)C(=O)NS(=O)(=O)c1ccc(Cl)cc1)C(=O)N1CCC[C@H]1C(=O)N[C@@H](C(C)C)C(=O)c1nc2cc(ccc2o1)C(N)=O
: