Target
Aryl hydrocarbon receptor
Ligand
BDBM23939
Substrate
Meas. Tech.
ChEMBL_911108 (CHEMBL3055293)
Ki
175388050±n/a nM
Citation
  TBA Med Chem Res 17:212-218 (2008)    Article 
Target
Name:
Aryl hydrocarbon receptor
Synonyms:
AHR BHLHE76 aryl hydrocarbon receptor precursor
Type:
PROTEIN
Mol. Mass.:
96143.77
Organism:
Homo sapiens (Human)
Description:
ChEMBL_1503828
Residue:
848
  
Inhibitor
Name:
BDBM23939
Synonyms:
1,3-dichloro-5-[(E)-2-(3-methoxyphenyl)ethenyl]benzene | trans-Stilbene Derivative, 4l
Type:
Small organic molecule
Emp. Form.:
C15H12Cl2O
Mol. Mass.:
279.161
SMILES:
COc1cccc(\C=C\c2cc(Cl)cc(Cl)c2)c1
: