Target
Proteinase-activated receptor 1
Ligand
BDBM50031432
Substrate
Meas. Tech.
ChEMBL_209245 (CHEMBL814872)
EC50
130±n/a nM
Citation
 Feng, DMVeber, DFConnolly, TMCondra, CTang, MJNutt, RF Development of a potent thrombin receptor ligand. J Med Chem 38:4125-30 (1995)  
Target
Name:
Proteinase-activated receptor 1
Synonyms:
CF2R F2R PAR1 Proteinase activated receptor 1 TR Thrombin receptor/ Proteinase-activated receptor 1(Par-1)
Type:
Protein
Mol. Mass.:
47450.07
Organism:
Homo sapiens (Human)
Description:
P25116
Residue:
425
  
Inhibitor
Name:
BDBM50031432
Synonyms:
(S)-2-{(S)-2-[(S)-2-((S)-2-Amino-propionylamino)-3-(4-fluoro-phenyl)-propionylamino]-5-guanidino-pentanoylamino}-4-methyl-pentanoic acid ((S)-1-carbamoyl-4-guanidino-butyl)-amide | CHEMBL131912
Type:
Small organic molecule
Emp. Form.:
C30H51FN12O5
Mol. Mass.:
678.8017
SMILES:
CC(C)C[C@H](NC(=O)[C@H](CCCNC(N)=N)NC(=O)[C@H](Cc1ccc(F)cc1)NC(=O)[C@H](C)N)C(=O)N[C@@H](CCCNC(N)=N)C(N)=O
: