Target
Maltase-glucoamylase
Ligand
BDBM50031483
Substrate
Meas. Tech.
ChEMBL_101864 (CHEMBL710107)
IC50
<50000±n/a nM
Citation
 Asano, NKizu, HOseki, KTomioka, EMatsui, KOkamoto, MBaba, M N-alkylated nitrogen-in-the-ring sugars: conformational basis of inhibition of glycosidases and HIV-1 replication. J Med Chem 38:2349-56 (1995)  
Target
Name:
Maltase-glucoamylase
Synonyms:
Alpha glucosidase MGA MGAML Maltase | Maltase-glucoamylase, intestinal
Type:
Enzyme
Mol. Mass.:
209817.06
Organism:
Homo sapiens (Human)
Description:
O43451
Residue:
1857
  
Inhibitor
Name:
BDBM50031483
Synonyms:
(2R,3R,4R,5R)-2,5-Bis-hydroxymethyl-1-methyl-pyrrolidine-3,4-diol | CHEMBL310231
Type:
Small organic molecule
Emp. Form.:
C7H15NO4
Mol. Mass.:
177.1983
SMILES:
CN1[C@H](CO)[C@@H](O)[C@H](O)[C@H]1CO
: