Target
Trehalase
Ligand
BDBM50016703
Substrate
Meas. Tech.
ChEMBL_208284 (CHEMBL813582)
IC50
25000±n/a nM
Citation
 Asano, NKizu, HOseki, KTomioka, EMatsui, KOkamoto, MBaba, M N-alkylated nitrogen-in-the-ring sugars: conformational basis of inhibition of glycosidases and HIV-1 replication. J Med Chem 38:2349-56 (1995)  
Target
Name:
Trehalase
Synonyms:
Alpha,alpha-trehalase
Type:
PROTEIN
Mol. Mass.:
63480.07
Organism:
Rattus norvegicus
Description:
ChEMBL_208284
Residue:
557
  
Inhibitor
Name:
BDBM50016703
Synonyms:
2-Hydroxymethyl-pyrrolidine-3,4-diol CHEMBL80254 | Imino-D-Arabinitol
Type:
Small organic molecule
Emp. Form.:
C5H11NO3
Mol. Mass.:
133.1457
SMILES:
OC[C@H]1NC[C@@H](O)[C@@H]1O
: