Target
Glutamate receptor 1
Ligand
BDBM50031702
Substrate
Meas. Tech.
ChEMBL_90133 (CHEMBL701233)
IC50
>7000±n/a nM
Citation
 Gu, ZQHesson, DPPelletier, JCMaccecchini, MLZhou, LMSkolnick, P Synthesis, resolution, and biological evaluation of the four stereoisomers of 4-methylglutamic acid: selective probes of kainate receptors. J Med Chem 38:2518-20 (1995)  
Target
Name:
Glutamate receptor 1
Synonyms:
AMPA-selective glutamate receptor 1 GluA1 GluR-A Glur1 Gria1
Type:
Protein
Mol. Mass.:
101583.91
Organism:
Rattus norvegicus (Rat)
Description:
P19490
Residue:
907
  
Inhibitor
Name:
BDBM50031702
Synonyms:
(2R,4S)-2-Amino-4-methyl-pentanedioic acid CHEMBL85447
Type:
Small organic molecule
Emp. Form.:
C6H11NO4
Mol. Mass.:
161.1558
SMILES:
C[C@@H](C[C@@H](N)C(O)=O)C(O)=O
: