Target
Type-1 angiotensin II receptor
Ligand
BDBM50031949
Substrate
Meas. Tech.
ChEMBL_36797 (CHEMBL650317)
Ki
4.3±n/a nM
Citation
 Kiyama, RHonma, THayashi, KOgawa, MHara, MFujimoto, MFujishita, T Novel angiotensin II receptor antagonists. Design, synthesis, and in vitro evaluation of dibenzo[a,d]cycloheptene and dibenzo[b,f]oxepin derivatives. Searching for bioisosteres of biphenylyltetrazole using a three-dimensional search technique. J Med Chem 38:2728-41 (1995)  
Target
Name:
Type-1 angiotensin II receptor
Synonyms:
AGTR1 AGTR1B AT1 AT1BR AT2R1B Angiotensin II receptor Type-1 angiotensin II receptor (AT1)
Type:
Protein
Mol. Mass.:
41080.75
Organism:
Homo sapiens (Human)
Description:
P30556
Residue:
359
  
Inhibitor
Name:
BDBM50031949
Synonyms:
3-(2-Methyl-5,6,7,8-tetrahydro-quinolin-4-yloxymethyl)-11-(1H-tetrazol-5-yl)-dibenzo[a,d]cyclohepten-5-one | CHEMBL327633
Type:
Small organic molecule
Emp. Form.:
C27H23N5O2
Mol. Mass.:
449.5038
SMILES:
Cc1cc(OCc2ccc3c(cc4ccccc4c(=O)c3c2)-c2nnn[nH]2)c2CCCCc2n1
: