Target
Type-1 angiotensin II receptor
Ligand
BDBM50031955
Substrate
Meas. Tech.
ChEMBL_36797 (CHEMBL650317)
Ki
0.7±n/a nM
Citation
 Kiyama, RHonma, THayashi, KOgawa, MHara, MFujimoto, MFujishita, T Novel angiotensin II receptor antagonists. Design, synthesis, and in vitro evaluation of dibenzo[a,d]cycloheptene and dibenzo[b,f]oxepin derivatives. Searching for bioisosteres of biphenylyltetrazole using a three-dimensional search technique. J Med Chem 38:2728-41 (1995)  
Target
Name:
Type-1 angiotensin II receptor
Synonyms:
AGTR1 AGTR1B AT1 AT1BR AT2R1B Angiotensin II receptor Type-1 angiotensin II receptor (AT1)
Type:
Protein
Mol. Mass.:
41080.75
Organism:
Homo sapiens (Human)
Description:
P30556
Residue:
359
  
Inhibitor
Name:
BDBM50031955
Synonyms:
5,7-Dimethyl-2-propyl-3-[11-(1H-tetrazol-5-yl)-dibenzo[b,f]oxepin-3-ylmethyl]-3H-imidazo[4,5-b]pyridine | CHEMBL410417
Type:
Small organic molecule
Emp. Form.:
C27H25N7O
Mol. Mass.:
463.5337
SMILES:
CCCc1nc2c(C)cc(C)nc2n1Cc1ccc2c(Oc3ccccc3C=C2c2nnn[nH]2)c1
: