Target
Type-1 angiotensin II receptor
Ligand
BDBM50031963
Substrate
Meas. Tech.
ChEMBL_36797 (CHEMBL650317)
Ki
4.3±n/a nM
Citation
 Kiyama, RHonma, THayashi, KOgawa, MHara, MFujimoto, MFujishita, T Novel angiotensin II receptor antagonists. Design, synthesis, and in vitro evaluation of dibenzo[a,d]cycloheptene and dibenzo[b,f]oxepin derivatives. Searching for bioisosteres of biphenylyltetrazole using a three-dimensional search technique. J Med Chem 38:2728-41 (1995)  
Target
Name:
Type-1 angiotensin II receptor
Synonyms:
AGTR1 AGTR1B AT1 AT1BR AT2R1B Angiotensin II receptor Type-1 angiotensin II receptor (AT1)
Type:
Protein
Mol. Mass.:
41080.75
Organism:
Homo sapiens (Human)
Description:
P30556
Residue:
359
  
Inhibitor
Name:
BDBM50031963
Synonyms:
2,6-Dimethyl-4-[5-oxo-11-(1H-tetrazol-5-yl)-5H-dibenzo[a,d]cyclohepten-3-ylmethoxy]-nicotinic acid ethyl ester | CHEMBL330109
Type:
Small organic molecule
Emp. Form.:
C27H23N5O4
Mol. Mass.:
481.5026
SMILES:
CCOC(=O)c1c(C)nc(C)cc1OCc1ccc2c(cc3ccccc3c(=O)c2c1)-c1nnn[nH]1
: