Target
Retinoic acid receptor alpha
Ligand
BDBM50032222
Substrate
Meas. Tech.
ChEMBL_197382 (CHEMBL799701)
EC50
2690±n/a nM
Citation
 Beard, RLChandraratna, RAColon, DFGillett, SJHenry, EMarler, DKSong, TDenys, LGarst, MEArefieg, T Synthesis and structure-activity relationships of stilbene retinoid analogs substituted with heteroaromatic carboxylic acids. J Med Chem 38:2820-9 (1995)  
Target
Name:
Retinoic acid receptor alpha
Synonyms:
NR1B1 RAR-alpha RARA_HUMAN Retinoic acid receptor alpha/Retinoid X receptor alpha Retinoid receptor
Type:
PROTEIN
Mol. Mass.:
50778.87
Organism:
Homo sapiens (Human)
Description:
ChEMBL_1466191
Residue:
462
  
Inhibitor
Name:
BDBM50032222
Synonyms:
6-[(E)-2-(3,5,5,8,8-Pentamethyl-5,6,7,8-tetrahydro-naphthalen-2-yl)-propenyl]-nicotinic acid | CHEMBL92926
Type:
Small organic molecule
Emp. Form.:
C24H29NO2
Mol. Mass.:
363.4926
SMILES:
C\C(=C/c1ccc(cn1)C(O)=O)c1cc2c(cc1C)C(C)(C)CCC2(C)C
: