Target
Adenosine kinase
Ligand
BDBM50412070
Substrate
Meas. Tech.
ChEMBL_912301 (CHEMBL3063318)
Ki
1300±n/a nM
Citation
  TBA Med Chem Res 21:590-600 (2012)    Article 
Target
Name:
Adenosine kinase
Synonyms:
ADK_TOXGO | AK
Type:
PROTEIN
Mol. Mass.:
38353.04
Organism:
Toxoplasma gondii
Description:
ChEMBL_629062
Residue:
363
  
Inhibitor
Name:
BDBM50412070
Synonyms:
CHEMBL59168
Type:
Small organic molecule
Emp. Form.:
C18H20N4O4S
Mol. Mass.:
388.441
SMILES:
Cc1cccc(CSc2ncnc3n(cnc23)[C@@H]2O[C@H](CO)[C@@H](O)[C@H]2O)c1
: