Target
Cannabinoid receptor 1
Ligand
BDBM50032545
Substrate
Meas. Tech.
ChEMBL_46624 (CHEMBL658880)
IC50
384±n/a nM
Citation
 Eissenstat, MABell, MRD'Ambra, TEAlexander, EJDaum, SJAckerman, JHGruett, MDKumar, VEstep, KGOlefirowicz, EM Aminoalkylindoles: structure-activity relationships of novel cannabinoid mimetics. J Med Chem 38:3094-105 (1995)  
Target
Name:
Cannabinoid receptor 1
Synonyms:
Brain-type cannabinoid receptor CB-R CNR1_RAT Cannabinoid receptor Cnr1 | Skr6
Type:
G Protein-Coupled Receptor (GPCR)
Mol. Mass.:
52856.55
Organism:
Rattus norvegicus (rat)
Description:
P20272
Residue:
473
  
Inhibitor
Name:
BDBM50032545
Synonyms:
CHEMBL80984 | {2-Methyl-1-[2-(3-methyl-morpholin-4-yl)-ethyl]-1H-indol-3-yl}-naphthalen-1-yl-methanone
Type:
Small organic molecule
Emp. Form.:
C27H28N2O2
Mol. Mass.:
412.5234
SMILES:
CC1COCCN1CCn1c(C)c(C(=O)c2cccc3ccccc23)c2ccccc12
: