Target
Alpha-1B adrenergic receptor
Ligand
BDBM50033112
Substrate
Meas. Tech.
ChEMBL_34313 (CHEMBL648098)
Ki
535±n/a nM
Citation
 Hieble, JPBondinell, WERuffolo, RR Alpha- and beta-adrenoceptors: from the gene to the clinic. 1. Molecular biology and adrenoceptor subclassification. J Med Chem 38:3415-44 (1995)  
Target
Name:
Alpha-1B adrenergic receptor
Synonyms:
ADA1B_HUMAN Adrenergic alpha1B Adrenergic receptor alpha Alpha 1B-adrenoreceptor | Alpha-1B adrenergic receptor
Type:
Enzyme
Mol. Mass.:
56862.13
Organism:
Homo sapiens (Human)
Description:
P35368
Residue:
520
  
Inhibitor
Name:
BDBM50033112
Synonyms:
6-{3-[4-(2-Methoxy-phenyl)-piperazin-1-yl]-propylamino}-1,3,5-trimethyl-1H-pyrimidine-2,4-dione Urapidil-5-methyl
Type:
Small organic molecule
Emp. Form.:
C21H31N5O3
Mol. Mass.:
401.5025
SMILES:
COc1ccccc1N1CCN(CCCNc2c(C)c(=O)n(C)c(=O)n2C)CC1
: