Target
Alpha-2C adrenergic receptor
Ligand
BDBM69602
Substrate
Meas. Tech.
ChEMBL_33537 (CHEMBL648703)
Ki
0.8±n/a nM
Citation
 Hieble, JPBondinell, WERuffolo, RR Alpha- and beta-adrenoceptors: from the gene to the clinic. 1. Molecular biology and adrenoceptor subclassification. J Med Chem 38:3415-44 (1995)  
Target
Name:
Alpha-2C adrenergic receptor
Synonyms:
ADA2C_HUMAN ADRA2L2 Adrenergic alpha2C Adrenergic receptor alpha Alpha-2 adrenergic receptor subtype C4 Alpha-2C adrenoreceptor | adrenergic, alpha-2C-, receptor [Homo sapiens]
Type:
Enzyme
Mol. Mass.:
49552.32
Organism:
Homo sapiens (Human)
Description:
P18825
Residue:
462
  
Inhibitor
Name:
BDBM69602
Synonyms:
2,3-dihydro-1,4-benzodioxin-3-ylmethyl-[2-(2,6-dimethoxyphenoxy)ethyl]amine;hydrochloride MLS000859914 SMR000326775 WB-4101 hydrochloride | cid_11957505
Type:
Small organic molecule
Emp. Form.:
C19H23NO5
Mol. Mass.:
345.3896
SMILES:
COc1cccc(OC)c1OCCNCC1COc2ccccc2O1
: