Target
Alpha-1D adrenergic receptor
Ligand
BDBM50033110
Substrate
Meas. Tech.
ChEMBL_32732 (CHEMBL646003)
Ki
3.5±n/a nM
Citation
 Hieble, JPBondinell, WERuffolo, RR Alpha- and beta-adrenoceptors: from the gene to the clinic. 1. Molecular biology and adrenoceptor subclassification. J Med Chem 38:3415-44 (1995)  
Target
Name:
Alpha-1D adrenergic receptor
Synonyms:
ADA1D_RAT Adra1d Alpha-1D adrenergic receptor | Serotonin 1a (5-HT1a) receptor/Adrenergic receptor alpha-1
Type:
Protein
Mol. Mass.:
59375.97
Organism:
Rattus norvegicus (Rat)
Description:
P23944
Residue:
561
  
Inhibitor
Name:
BDBM50033110
Synonyms:
ALFUZOSIN N-{3-[(4-amino-6,7-dimethoxyquinazolin-2-yl)(methyl)amino]propyl}tetrahydrofuran-2-carboxamide
Type:
Small organic molecule
Emp. Form.:
C19H27N5O4
Mol. Mass.:
389.4488
SMILES:
COc1cc2nc(nc(N)c2cc1OC)N(C)CCCNC(=O)C1CCCO1
: