Target
C5a anaphylatoxin chemotactic receptor 1
Ligand
BDBM50033565
Substrate
Meas. Tech.
ChEMBL_157769 (CHEMBL767672)
EC50
19500±n/a nM
Citation
 Sanderson, SDKirnarsky, LSherman, SAVogen, SMPrakash, OEmber, JAFinch, AMTaylor, SM Decapeptide agonists of human C5a: the relationship between conformation and neutrophil response. J Med Chem 38:3669-75 (1995)  
Target
Name:
C5a anaphylatoxin chemotactic receptor 1
Synonyms:
C5AR C5AR1_HUMAN C5a anaphylatoxin chemotactic receptor C5a-R | CD_antigen=CD88
Type:
Enzyme
Mol. Mass.:
39347.68
Organism:
Homo sapiens (Human)
Description:
P21730
Residue:
350
  
Inhibitor
Name:
BDBM50033565
Synonyms:
CHEMBL262653 | Tyr-Ser-Phe-Lys-Asp-Cys-Pro-Leu-Gly-Arg
Type:
Small organic molecule
Emp. Form.:
C53H80N14O15S
Mol. Mass.:
1185.352
SMILES:
CC(C)C[C@H](NC(=O)[C@@H]1CCCN1C(=O)[C@H](CS)NC(=O)[C@H](CC(O)=O)NC(=O)[C@H](CCCCN)NC(=O)[C@H](Cc1ccccc1)NC(=O)[C@H](CO)NC(=O)[C@@H](N)Cc1ccc(O)cc1)C(=O)NCC(=O)N[C@@H](CCCNC(N)=N)C(O)=O
: