Target
D(2) dopamine receptor
Ligand
BDBM50069907
Substrate
Meas. Tech.
ChEMBL_932180 (CHEMBL3073098)
Ki
5.5±n/a nM
Citation
  TBA Med Chem Res 22:520-530 (2013)    Article 
Target
Name:
D(2) dopamine receptor
Synonyms:
DOPAMINE D2 DOPAMINE D2 Short Dopamine D2 receptor Drd2
Type:
G Protein-Coupled Receptor (GPCR)
Mol. Mass.:
50931.60
Organism:
Rattus norvegicus (rat)
Description:
P61169
Residue:
444
  
Inhibitor
Name:
BDBM50069907
Synonyms:
1-benzyl-4-(3-hydroxyphenyl)piperazine CHEMBL88365
Type:
Small organic molecule
Emp. Form.:
C17H20N2O
Mol. Mass.:
268.3535
SMILES:
Oc1cccc(c1)N1CCN(Cc2ccccc2)CC1
: