Target
Beta-lactamase
Ligand
BDBM50033701
Substrate
Meas. Tech.
ChEMBL_40543 (CHEMBL652173)
IC50
25±n/a nM
Citation
 Buynak, JDWu, KBachmann, BKhasnis, DHua, LNguyen, HKCarver, CL Synthesis and biological activity of 7-alkylidenecephems. J Med Chem 38:1022-34 (1995)  
Target
Name:
Beta-lactamase
Synonyms:
AMPC_ENTCL | ampC
Type:
PROTEIN
Mol. Mass.:
41306.67
Organism:
Enterobacter cloacae
Description:
ChEMBL_40258
Residue:
381
  
Inhibitor
Name:
BDBM50033701
Synonyms:
CHEMBL268632 | Sodium; (R)-3-acetoxymethyl-5,5,8-trioxo-7-[1-pyridin-2-yl-meth-(Z)-ylidene]-5lambda*6*-thia-1-aza-bicyclo[4.2.0]oct-2-ene-2-carboxylate
Type:
Small organic molecule
Emp. Form.:
C16H13N2O7S
Mol. Mass.:
377.349
SMILES:
CC(=O)OCC1=C(N2[C@@H](\C(=C/c3ccccn3)C2=O)S(=O)(=O)C1)C([O-])=O
: