Target
Peroxisome proliferator-activated receptor gamma
Ligand
BDBM50147581
Substrate
Meas. Tech.
ChEMBL_933250 (CHEMBL3069174)
IC50
21000±n/a nM
Citation
  TBA Med Chem Res 22:3126-3133 (2013)    Article 
Target
Name:
Peroxisome proliferator-activated receptor gamma
Synonyms:
NR1C3 PPAR-gamma PPARG_HUMAN Peroxisome proliferator-activated receptor gamma (PPAR gamma) Peroxisome proliferator-activated receptor gamma (PPARĪ³) peroxisome proliferator-activated receptor gamma isoform 2
Type:
Nuclear Receptor
Mol. Mass.:
57613.46
Organism:
Homo sapiens (Human)
Description:
P37231
Residue:
505
  
Inhibitor
Name:
BDBM50147581
Synonyms:
1-tridecanecarboxylic acid CH3-[CH2]12-COOH Myristinsaeure myristic acid n-Tetradecoic acid tetradecoic acid
Type:
Small organic molecule
Emp. Form.:
C14H28O2
Mol. Mass.:
228.3709
SMILES:
CCCCCCCCCCCCCC(O)=O
: