Target
Thymidylate synthase
Ligand
BDBM50033921
Substrate
Meas. Tech.
ChEMBL_209795 (CHEMBL815661)
IC50
24±n/a nM
Citation
 Marsham, PRJackman, ALBarker, AJBoyle, FTPegg, SJWardleworth, JMKimbell, RO'Connor, BMCalvert, AHHughes, LR Quinazoline antifolate thymidylate synthase inhibitors: replacement of glutamic acid in the C2-methyl series. J Med Chem 38:994-1004 (1995)  
Target
Name:
Thymidylate synthase
Synonyms:
TS TYSY_MOUSE | Tyms
Type:
PROTEIN
Mol. Mass.:
34957.15
Organism:
Mus musculus
Description:
ChEMBL_1340097
Residue:
307
  
Inhibitor
Name:
BDBM50033921
Synonyms:
(R)-{4-[(2-Methyl-4-oxo-3,4-dihydro-quinazolin-6-ylmethyl)-prop-2-ynyl-amino]-benzoylamino}-(3-nitro-phenyl)-acetic acid | CHEMBL6636
Type:
Small organic molecule
Emp. Form.:
C28H23N5O6
Mol. Mass.:
525.5121
SMILES:
Cc1nc2ccc(CN(CC#C)c3ccc(cc3)C(=O)N[C@@H](C(O)=O)c3cccc(c3)[N+]([O-])=O)cc2c(=O)[nH]1
: