Target
Sterol O-acyltransferase 1
Ligand
BDBM50033974
Substrate
Meas. Tech.
ChEMBL_28792 (CHEMBL641702)
IC50
60±n/a nM
Citation
 Maduskuie, TPWilde, RGBillheimer, JTCromley, DAGermain, SGillies, PJHigley, CAJohnson, ALPennev, PShimshick, EJ Design, synthesis, and structure--activity relationship studies for a new imidazole series of J774 macrophage specific acyl-CoA:cholesterol acyltransferase (ACAT) inhibitors. J Med Chem 38:1067-83 (1995)  
Target
Name:
Sterol O-acyltransferase 1
Synonyms:
ACAT-1 Acat SOAT1_RAT Sterol O-acyltransferase, Soat
Type:
PROTEIN
Mol. Mass.:
64165.56
Organism:
Rattus norvegicus
Description:
ChEMBL_28796
Residue:
545
  
Inhibitor
Name:
BDBM50033974
Synonyms:
3-(2,4-Difluoro-phenyl)-1-[5-(4,5-dipropyl-1H-imidazol-2-ylsulfanyl)-pentyl]-1-heptyl-urea | CHEMBL274166
Type:
Small organic molecule
Emp. Form.:
C28H44F2N4OS
Mol. Mass.:
522.737
SMILES:
CCCCCCCN(CCCCCSc1nc(CCC)c(CCC)[nH]1)C(=O)Nc1ccc(F)cc1F
: