Target
Sterol O-acyltransferase 1
Ligand
BDBM50033989
Substrate
Meas. Tech.
ChEMBL_28792 (CHEMBL641702)
IC50
>50000±n/a nM
Citation
 Maduskuie, TPWilde, RGBillheimer, JTCromley, DAGermain, SGillies, PJHigley, CAJohnson, ALPennev, PShimshick, EJ Design, synthesis, and structure--activity relationship studies for a new imidazole series of J774 macrophage specific acyl-CoA:cholesterol acyltransferase (ACAT) inhibitors. J Med Chem 38:1067-83 (1995)  
Target
Name:
Sterol O-acyltransferase 1
Synonyms:
ACAT-1 Acat SOAT1_RAT Sterol O-acyltransferase, Soat
Type:
PROTEIN
Mol. Mass.:
64165.56
Organism:
Rattus norvegicus
Description:
ChEMBL_28796
Residue:
545
  
Inhibitor
Name:
BDBM50033989
Synonyms:
1-{5-[4,5-Bis-(4-methanesulfonyl-phenyl)-1H-imidazol-2-ylsulfanyl]-pentyl}-3-(2,4-difluoro-phenyl)-1-heptyl-urea | CHEMBL274214
Type:
Small organic molecule
Emp. Form.:
C36H44F2N4O5S3
Mol. Mass.:
746.95
SMILES:
CCCCCCCN(CCCCCSc1nc(c([nH]1)-c1ccc(cc1)S(C)(=O)=O)-c1ccc(cc1)S(C)(=O)=O)C(=O)Nc1ccc(F)cc1F
: