Target
Sterol O-acyltransferase 1
Ligand
BDBM50033972
Substrate
Meas. Tech.
ChEMBL_28792 (CHEMBL641702)
IC50
500±n/a nM
Citation
 Maduskuie, TPWilde, RGBillheimer, JTCromley, DAGermain, SGillies, PJHigley, CAJohnson, ALPennev, PShimshick, EJ Design, synthesis, and structure--activity relationship studies for a new imidazole series of J774 macrophage specific acyl-CoA:cholesterol acyltransferase (ACAT) inhibitors. J Med Chem 38:1067-83 (1995)  
Target
Name:
Sterol O-acyltransferase 1
Synonyms:
ACAT-1 Acat SOAT1_RAT Sterol O-acyltransferase, Soat
Type:
PROTEIN
Mol. Mass.:
64165.56
Organism:
Rattus norvegicus
Description:
ChEMBL_28796
Residue:
545
  
Inhibitor
Name:
BDBM50033972
Synonyms:
1-{5-[4,5-Bis-(4-methoxy-phenyl)-1H-imidazol-2-ylsulfanyl]-pentyl}-3-isopropyl-1-[2-(2-methoxy-ethoxy)-ethyl]-urea | CHEMBL11316
Type:
Small organic molecule
Emp. Form.:
C31H44N4O5S
Mol. Mass.:
584.77
SMILES:
COCCOCCN(CCCCCSc1nc(c([nH]1)-c1ccc(OC)cc1)-c1ccc(OC)cc1)C(=O)NC(C)C
: