Target
5-hydroxytryptamine receptor 1A
Ligand
BDBM50034324
Substrate
Meas. Tech.
ChEMBL_589 (CHEMBL615459)
Ki
17±n/a nM
Citation
 Jain, ANHarris, NLPark, JY Quantitative binding site model generation: compass applied to multiple chemotypes targeting the 5-HT1A receptor. J Med Chem 38:1295-308 (1995)  
Target
Name:
5-hydroxytryptamine receptor 1A
Synonyms:
5-HT-1A 5-hydroxytryptamine receptor 1A (5-HT-1A) ADRB2RL1 Dopamine D2 receptor and serotonin 1a receptor HTR1A | Serotonin receptor 1A
Type:
Mol. Mass.:
46122.49
Organism:
Homo sapiens (Human)
Description:
Residue:
422
  
Inhibitor
Name:
BDBM50034324
Synonyms:
(3aS,9aR) 5-Methoxy-1-propyl-2,3,3a,4,9,9a-hexahydro-1H-benzo[f]indole 5-Methoxy-1-propyl-2,3,3a,4,9,9a-hexahydro-1H-benzo[f]indole | CHEMBL11388
Type:
Small organic molecule
Emp. Form.:
C16H23NO
Mol. Mass.:
245.3599
SMILES:
CCCN1CC[C@@H]2Cc3c(C[C@@H]12)cccc3OC
: