Target
Prothrombin
Ligand
BDBM50034588
Substrate
Meas. Tech.
ChEMBL_208173 (CHEMBL819079)
Ki
7.0±n/a nM
Citation
 Deadman, JJElgendy, SGoodwin, CAGreen, DBaban, JAPatel, GSkordalakes, EChino, NClaeson, GKakkar, VV Characterization of a class of peptide boronates with neutral P1 side chains as highly selective inhibitors of thrombin. J Med Chem 38:1511-22 (1995)  
Target
Name:
Prothrombin
Synonyms:
Activation peptide fragment 1 Coagulation factor II Prothrombin precursor Thrombin heavy chain | Thrombin light chain
Type:
Protein
Mol. Mass.:
70029.57
Organism:
Homo sapiens (Human)
Description:
P00734
Residue:
622
  
Inhibitor
Name:
BDBM50034588
Synonyms:
CHEMBL286606 | Peptide boronate
Type:
Small organic molecule
Emp. Form.:
C36H47BBrN3O6
Mol. Mass.:
708.49
SMILES:
CC1(C)C2CC1[C@]1(C)OB(O[C@@H]1C2)C(CCCBr)NC(=O)[C@@H]1CCCN1C(=O)[C@H](Cc1ccccc1)NC(=O)OCc1ccccc1
: