Target
Plasminogen
Ligand
BDBM50034577
Substrate
Meas. Tech.
ChEMBL_155232 (CHEMBL764722)
Ki
2.9±n/a nM
Citation
 Deadman, JJElgendy, SGoodwin, CAGreen, DBaban, JAPatel, GSkordalakes, EChino, NClaeson, GKakkar, VV Characterization of a class of peptide boronates with neutral P1 side chains as highly selective inhibitors of thrombin. J Med Chem 38:1511-22 (1995)  
Target
Name:
Plasminogen
Synonyms:
Activation peptide PLG Plasmin Plasmin heavy chain A, short form | Plasmin light chain B
Type:
Enzyme
Mol. Mass.:
90579.18
Organism:
Homo sapiens (Human)
Description:
Residue:
810
  
Inhibitor
Name:
BDBM50034577
Synonyms:
CHEMBL291026 | Peptide boronate
Type:
Small organic molecule
Emp. Form.:
C38H52BN3O6
Mol. Mass.:
657.647
SMILES:
CCCCCC(NC(=O)[C@@H]1CCCN1C(=O)[C@H](Cc1ccccc1)NC(=O)OCc1ccccc1)B1O[C@@H]2CC3CC(C3(C)C)[C@]2(C)O1
: