Target
Cathepsin G
Ligand
BDBM50034576
Substrate
Meas. Tech.
ChEMBL_45358 (CHEMBL661894)
Ki
3.85±n/a nM
Citation
 Deadman, JJElgendy, SGoodwin, CAGreen, DBaban, JAPatel, GSkordalakes, EChino, NClaeson, GKakkar, VV Characterization of a class of peptide boronates with neutral P1 side chains as highly selective inhibitors of thrombin. J Med Chem 38:1511-22 (1995)  
Target
Name:
Cathepsin G
Synonyms:
CATG_HUMAN CTSG
Type:
PROTEIN
Mol. Mass.:
28860.08
Organism:
Homo sapiens (Human)
Description:
ChEMBL_1469016
Residue:
255
  
Inhibitor
Name:
BDBM50034576
Synonyms:
CHEMBL288176 | Peptide boronate
Type:
Small organic molecule
Emp. Form.:
C42H54BN3O6
Mol. Mass.:
707.706
SMILES:
CCC(C)(C)C(NC(=O)[C@@H]1CCCN1C(=O)[C@H](Cc1ccc2ccccc2c1)NC(=O)OCc1ccccc1)B1O[C@@H]2CC3CC(C3(C)C)[C@]2(C)O1
: