Target
Chymotrypsinogen A
Ligand
BDBM50034580
Substrate
Meas. Tech.
ChEMBL_49451 (CHEMBL659799)
Ki
0.021±n/a nM
Citation
 Deadman, JJElgendy, SGoodwin, CAGreen, DBaban, JAPatel, GSkordalakes, EChino, NClaeson, GKakkar, VV Characterization of a class of peptide boronates with neutral P1 side chains as highly selective inhibitors of thrombin. J Med Chem 38:1511-22 (1995)  
Target
Name:
Chymotrypsinogen A
Synonyms:
Alpha-chymotrypsin Chymotrypsin A Chymotrypsin A chain B Chymotrypsinogen A | alpha-Chymotrypsin (α-Chymotrypsin)
Type:
Serine protease
Mol. Mass.:
25670.88
Organism:
Bos taurus (bovine)
Description:
Residue:
245
  
Inhibitor
Name:
BDBM50034580
Synonyms:
CHEMBL418050 | Peptide boronate
Type:
Small organic molecule
Emp. Form.:
C46H52BN3O6
Mol. Mass.:
753.733
SMILES:
CC1(C)C2CC1[C@]1(C)OB(O[C@@H]1C2)C(Cc1ccccc1)NC(=O)[C@@H]1CCCN1C(=O)[C@@H](NC(=O)OCc1ccccc1)C(c1ccccc1)c1ccccc1
: