Target
Presenilin-1
Ligand
BDBM50489353
Substrate
Meas. Tech.
ChEMBL_933739 (CHEMBL2320841)
IC50
2.1±n/a nM
Citation
 Wu, WLAsberom, TBara, TBennett, CBurnett, DAClader, JDomalski, MGreenlee, WJJosien, HMcBriar, MRajagopalan, MVicarel, MXu, RHyde, LADel Vecchio, RACohen-Williams, MESong, LLee, JTerracina, GZhang, QNomeir, AParker, EMZhang, L Structure activity relationship studies of tricyclic bispyran sulfone ?-secretase inhibitors. Bioorg Med Chem Lett 23:844-9 (2013)  
Target
Name:
Presenilin-1
Synonyms:
3.4.23.- Gamma-Secretase Subunit Presenilin-1 PS1 PSEN1 PSNL1 Presenilin-1 CTF12 Protein S182
Type:
Mol. Mass.:
52657.13
Organism:
Homo sapiens (Human)
Description:
P49768
Residue:
467
  
Inhibitor
Name:
BDBM50489353
Synonyms:
CHEMBL2314609
Type:
Small organic molecule
Emp. Form.:
C23H23ClF2O6S2
Mol. Mass.:
533.005
SMILES:
[H][C@@]12COc3c(F)ccc(F)c3[C@@]1(CCO[C@H]2CCS(=O)(=O)C1CC1)S(=O)(=O)c1ccc(Cl)cc1
: