Target
Muscarinic acetylcholine receptor
Ligand
BDBM50034872
Substrate
Meas. Tech.
ChEMBL_138323 (CHEMBL748203)
Ki
59±n/a nM
Citation
 Kiesewetter, DOSilverton, JVEckelman, WC Syntheses and biological properties of chiral fluoroalkyl quinuclidinyl benzilates. J Med Chem 38:1711-9 (1995)  
Target
Name:
Muscarinic acetylcholine receptor
Synonyms:
GPM3 | Muscarinic acetylcholine receptor M3
Type:
Mol. Mass.:
66272.13
Organism:
Cavia porcellus
Description:
Residue:
587
  
Inhibitor
Name:
BDBM50034872
Synonyms:
(S)-[4-(3-Fluoro-propyl)-phenyl]-hydroxy-phenyl-acetic acid 1-aza-bicyclo[2.2.2]oct-3-yl ester | CHEMBL296895
Type:
Small organic molecule
Emp. Form.:
C24H28FNO3
Mol. Mass.:
397.4824
SMILES:
O[C@@](C(=O)OC1CN2CCC1CC2)(c1ccccc1)c1ccc(CCCF)cc1
: