Target
Muscarinic receptor M1
Ligand
BDBM50010096
Substrate
Meas. Tech.
ChEMBL_138130 (CHEMBL872660)
Ki
0.22±n/a nM
Citation
 Kiesewetter, DOSilverton, JVEckelman, WC Syntheses and biological properties of chiral fluoroalkyl quinuclidinyl benzilates. J Med Chem 38:1711-9 (1995)  
Target
Name:
Muscarinic receptor M1
Synonyms:
Muscarinic acetylcholine receptor M1
Type:
PROTEIN
Mol. Mass.:
15022.43
Organism:
Bos taurus
Description:
ChEMBL_140161
Residue:
139
  
Inhibitor
Name:
BDBM50010096
Synonyms:
CHEMBL12980 Hydroxy-diphenyl-acetic acid 1-aza-bicyclo[2.2.2]oct-3-yl ester(QNB) | Hydroxy-diphenyl-acetic acid 1-aza-bicyclo[2.2.2]oct-3-yl ester(R)-(-)-(QNB)
Type:
Small organic molecule
Emp. Form.:
C21H23NO3
Mol. Mass.:
337.4122
SMILES:
OC(C(=O)OC1CN2CCC1CC2)(c1ccccc1)c1ccccc1
: