Target
Muscarinic acetylcholine receptor M2
Ligand
BDBM50034873
Substrate
Meas. Tech.
ChEMBL_138162 (CHEMBL748226)
Ki
3.30±n/a nM
Citation
 Kiesewetter, DOSilverton, JVEckelman, WC Syntheses and biological properties of chiral fluoroalkyl quinuclidinyl benzilates. J Med Chem 38:1711-9 (1995)  
Target
Name:
Muscarinic acetylcholine receptor M2
Synonyms:
ACM2_RAT Chrm-2 | Chrm2
Type:
Enzyme Catalytic Domain
Mol. Mass.:
51555.53
Organism:
RAT
Description:
P10980
Residue:
466
  
Inhibitor
Name:
BDBM50034873
Synonyms:
(S)-(4-Fluoromethyl-phenyl)-hydroxy-phenyl-acetic acid 1-aza-bicyclo[2.2.2]oct-3-yl ester | CHEMBL47650
Type:
Small organic molecule
Emp. Form.:
C22H24FNO3
Mol. Mass.:
369.4293
SMILES:
O[C@@](C(=O)OC1CN2CCC1CC2)(c1ccccc1)c1ccc(CF)cc1
: