Target
Solute carrier organic anion transporter family member 1B1
Ligand
BDBM50380880
Substrate
Meas. Tech.
ChEMBL_941316 (CHEMBL2329940)
IC50
398±n/a nM
Citation
 Procopiou, PABarrett, JWBarton, NPBegg, MClapham, DCopley, RCFord, AJGraves, RHHall, DAHancock, APHill, APHobbs, HHodgson, STJumeaux, CLacroix, YMMiah, AHMorriss, KMNeedham, DSheriff, EBSlack, RJSmith, CESollis, SLStaton, H Synthesis and structure-activity relationships of indazole arylsulfonamides as allosteric CC-chemokine receptor 4 (CCR4) antagonists. J Med Chem 56:1946-60 (2013)  
Target
Name:
Solute carrier organic anion transporter family member 1B1
Synonyms:
LST1 OATP2 SLC21A6 SO1B1_HUMAN Solute carrier organic anion transporter family member 1B1 (OATP1B1) | Thromboxane B2
Type:
Protein
Mol. Mass.:
76468.06
Organism:
Homo sapiens (Human)
Description:
Q9Y6L6
Residue:
691
  
Inhibitor
Name:
BDBM50380880
Synonyms:
CHEMBL2018969
Type:
Small organic molecule
Emp. Form.:
C24H25ClN4O5S2
Mol. Mass.:
549.062
SMILES:
COc1cccc2n(Cc3cccc(CNC(=O)C(C)(C)O)c3)nc(NS(=O)(=O)c3ccc(Cl)s3)c12
: