Target
Integrase
Ligand
BDBM76305
Substrate
Meas. Tech.
ChEMBL_940681 (CHEMBL2327747)
IC50
>20000±n/a nM
Citation
 Serrao, EDebnath, BOtake, HKuang, YChrist, FDebyser, ZNeamati, N Fragment-based discovery of 8-hydroxyquinoline inhibitors of the HIV-1 integrase-lens epithelium-derived growth factor/p75 (IN-LEDGF/p75) interaction. J Med Chem 56:2311-22 (2013)  
Target
Name:
Integrase
Synonyms:
pol
Type:
PROTEIN
Mol. Mass.:
32203.43
Organism:
Human immunodeficiency virus 1
Description:
ChEMBL_106649
Residue:
288
  
Inhibitor
Name:
BDBM76305
Synonyms:
5-chloranylquinolin-8-ol 5-chloroquinolin-8-ol SMR000274338 | cid_2817
Type:
Small organic molecule
Emp. Form.:
C9H6ClNO
Mol. Mass.:
179.603
SMILES:
Oc1ccc(Cl)c2cccnc12
: