Target
Muscarinic acetylcholine receptor M1
Ligand
BDBM50035280
Substrate
Meas. Tech.
ChEMBL_138274 (CHEMBL744231)
EC50
170±n/a nM
Citation
 Bräuner-Osborne, HEbert, BBrann, MRFalch, EKrogsgaard-Larsen, P Annulated heterocyclic bioisosteres of norarecoline. Synthesis and molecular pharmacology at five recombinant human muscarinic acetylcholine receptors. J Med Chem 38:2188-95 (1995)  
Target
Name:
Muscarinic acetylcholine receptor M1
Synonyms:
ACM1_HUMAN Cholinergic receptor, muscarinic 1 | Cholinergic, muscarinic M1
Type:
Protein
Mol. Mass.:
51442.54
Organism:
Homo sapiens (Human)
Description:
P11229
Residue:
460
  
Inhibitor
Name:
BDBM50035280
Synonyms:
3-Isopropoxy-5,6,7,8-tetrahydro-4H-isoxazolo[4,5-c]azepine | CHEMBL305264
Type:
Small organic molecule
Emp. Form.:
C10H16N2O2
Mol. Mass.:
196.2462
SMILES:
CC(C)Oc1noc2CCCNCc12
: