Target
Muscarinic acetylcholine receptor M2
Ligand
BDBM50036189
Substrate
Meas. Tech.
ChEMBL_139350 (CHEMBL752398)
Ki
5000±n/a nM
Citation
 Nilsson, BMSundquist, SJohansson, GNordvall, GGlas, GNilvebrant, LHacksell, U 3-Heteroaryl-substituted quinuclidin-3-ol and quinuclidin-2-ene derivatives as muscarinic antagonists. Synthesis and structure-activity relationships. J Med Chem 38:473-87 (1995)  
Target
Name:
Muscarinic acetylcholine receptor M2
Synonyms:
ACM2_HUMAN Cholinergic, muscarinic M2 Muscarinic acetylcholine receptor M2 and M5 | RecName: Full=Muscarinic acetylcholine receptor M2
Type:
GPCR
Mol. Mass.:
51730.61
Organism:
Homo sapiens (Human)
Description:
P08172
Residue:
466
  
Inhibitor
Name:
BDBM50036189
Synonyms:
3-(Tetrahydro-furan-2-yl)-1-aza-bicyclo[2.2.2]octane | CHEMBL343182
Type:
Small organic molecule
Emp. Form.:
C11H19NO
Mol. Mass.:
181.2747
SMILES:
C1COC(C1)C1CN2CCC1CC2
: