Target
Muscarinic acetylcholine receptor
Ligand
BDBM50036171
Substrate
Meas. Tech.
ChEMBL_138314 (CHEMBL743825)
Ki
240±n/a nM
Citation
 Nilsson, BMSundquist, SJohansson, GNordvall, GGlas, GNilvebrant, LHacksell, U 3-Heteroaryl-substituted quinuclidin-3-ol and quinuclidin-2-ene derivatives as muscarinic antagonists. Synthesis and structure-activity relationships. J Med Chem 38:473-87 (1995)  
Target
Name:
Muscarinic acetylcholine receptor
Synonyms:
GPM3 | Muscarinic acetylcholine receptor M3
Type:
Mol. Mass.:
66272.13
Organism:
Cavia porcellus
Description:
Residue:
587
  
Inhibitor
Name:
BDBM50036171
Synonyms:
3-Benzofuran-2-yl-1-aza-bicyclo[2.2.2]octane | CHEMBL144693
Type:
Small organic molecule
Emp. Form.:
C15H17NO
Mol. Mass.:
227.3016
SMILES:
C1CN2CCC1C(C2)c1cc2ccccc2o1
: