Target
Neutrophil elastase
Ligand
BDBM50036479
Substrate
Meas. Tech.
ChEMBL_64003 (CHEMBL673112)
Ki
15±n/a nM
Citation
 Hlasta, DJSubramanyam, CBell, MRCarabateas, PMCourt, JJDesai, RCDrozd, MLEickhoff, WMFerguson, EWGordon, RJ Orally bioavailable benzisothiazolone inhibitors of human leukocyte elastase. J Med Chem 38:739-44 (1995)  
Target
Name:
Neutrophil elastase
Synonyms:
Bone marrow serine protease Coagulation factor X ELANE Elastase HLE Leukocyte elastase Medullasin Neutrophil elastase (HNE) PMN elastase Trypsin
Type:
Enzyme
Mol. Mass.:
28532.38
Organism:
Homo sapiens (Human)
Description:
P08246
Residue:
267
  
Inhibitor
Name:
BDBM50036479
Synonyms:
1,1-Dioxo-2-(1-phenyl-1H-tetrazol-5-ylsulfanylmethyl)-1,2-dihydro-1lambda*6*-benzo[d]isothiazol-3-one | CHEMBL50803
Type:
Small organic molecule
Emp. Form.:
C15H11N5O3S2
Mol. Mass.:
373.41
SMILES:
O=C1N(CSc2nnnn2-c2ccccc2)S(=O)(=O)c2ccccc12
: