Target
Cannabinoid receptor 1
Ligand
BDBM50491839
Substrate
Meas. Tech.
ChEMBL_960430 (CHEMBL2389081)
Ki
19±n/a nM
Citation
 Kusakabe, KIso, YTada, YSakagami, MMorioka, YChomei, NShinonome, SKawamoto, KTakenaka, HYasui, KHamana, HHanasaki, K Selective CB2 agonists with anti-pruritic activity: discovery of potent and orally available bicyclic 2-pyridones. Bioorg Med Chem 21:3154-63 (2013)  
Target
Name:
Cannabinoid receptor 1
Synonyms:
CANN6 CB-R CNR CNR1_HUMAN Cannabinoid receptor Cannabinoid receptor 1 (brain)
Type:
G Protein-Coupled Receptor (GPCR)
Mol. Mass.:
52868.96
Organism:
Homo sapiens (Human)
Description:
P21554
Residue:
472
  
Inhibitor
Name:
BDBM50491839
Synonyms:
CHEMBL2387183
Type:
Small organic molecule
Emp. Form.:
C22H34N2O2
Mol. Mass.:
358.5176
SMILES:
CCCCn1c2CCCCCCc2cc(C(=O)NC2CCCCC2)c1=O
: