Target
Cannabinoid receptor 2
Ligand
BDBM50491845
Substrate
Meas. Tech.
ChEMBL_960431 (CHEMBL2389082)
Ki
17±n/a nM
Citation
 Kusakabe, KIso, YTada, YSakagami, MMorioka, YChomei, NShinonome, SKawamoto, KTakenaka, HYasui, KHamana, HHanasaki, K Selective CB2 agonists with anti-pruritic activity: discovery of potent and orally available bicyclic 2-pyridones. Bioorg Med Chem 21:3154-63 (2013)  
Target
Name:
Cannabinoid receptor 2
Synonyms:
CANNABINOID CB2 CB2 CB2B CNR2_HUMAN Cannabinoid CB2 receptor Cannabinoid receptor 2 (CB2R) | hCB2
Type:
G Protein-Coupled Receptor (GPCR)
Mol. Mass.:
39690.94
Organism:
Homo sapiens (Human)
Description:
P34972
Residue:
360
  
Inhibitor
Name:
BDBM50491845
Synonyms:
CHEMBL2387076
Type:
Small organic molecule
Emp. Form.:
C21H26N2O2
Mol. Mass.:
338.4433
SMILES:
CCCCn1c2CCCCc2cc(C(=O)NCc2ccccc2)c1=O
: