Target
Epidermal growth factor receptor
Ligand
BDBM50036699
Substrate
Meas. Tech.
ChEMBL_63789 (CHEMBL677393)
IC50
87000±n/a nM
Citation
 Gazit, AOsherov, NPosner, IBar-Sinai, AGilon, CLevitzki, A Tyrphostins. 3. Structure-activity relationship studies of alpha-substituted benzylidenemalononitrile 5-S-aryltyrphostins. J Med Chem 36:3556-64 (1994)  
Target
Name:
Epidermal growth factor receptor
Synonyms:
EGF Receptor Substrate EGFR_HUMAN ERBB1 Epidermal Growth Factor Receptor erbB-1 Epidermal growth factor receptor (EGFR) HER1 Proto-oncogene c-ErbB-1 Tyrosine-Protein Kinase ErbB-1
Type:
Receptor Kinase Domain
Mol. Mass.:
134279.59
Organism:
Homo sapiens (Human)
Description:
P00533
Residue:
1210
  
Inhibitor
Name:
BDBM50036699
Synonyms:
2-(4-Hydroxy-3-methoxy-5-methyl-benzylidene)-malononitrile | CHEMBL120564
Type:
Small organic molecule
Emp. Form.:
C12H10N2O2
Mol. Mass.:
214.22
SMILES:
[#6]-[#8]-c1cc(\[#6]=[#6](/C#N)C#N)cc(-[#6])c1-[#8]
: