Target
Tyrosine-protein kinase Lck
Ligand
BDBM4341
Substrate
Meas. Tech.
ChEBML_210732
IC50
3000±n/a nM
Citation
 Gazit, AOsherov, NPosner, IBar-Sinai, AGilon, CLevitzki, A Tyrphostins. 3. Structure-activity relationship studies of alpha-substituted benzylidenemalononitrile 5-S-aryltyrphostins. J Med Chem 36:3556-64 (1994)  
Target
Name:
Tyrosine-protein kinase Lck
Synonyms:
2.7.10.2 LCK_HUMAN Leukocyte C-terminal Src kinase Lymphocyte-specific protein tyrosine kinase Protein YT16 Proto-oncogene tyrosine-protein kinase LCK T cell-specific protein-tyrosine kinase
Type:
Mol. Mass.:
57987.83
Organism:
Homo sapiens (Human)
Description:
P06239
Residue:
509
  
Inhibitor
Name:
BDBM4341
Synonyms:
2-[(3,4,5-trihydroxyphenyl)methylidene]propanedinitrile | benzylidenemalononitrile (BMN) deriv. 25
Type:
Small organic molecule
Emp. Form.:
C10H6N2O3
Mol. Mass.:
202.1662
SMILES:
[#8]-c1cc(\[#6]=[#6](/C#N)C#N)cc(-[#8])c1-[#8]
: